Target
Amine oxidase [flavin-containing] B
Ligand
BDBM206300
Substrate
Meas. Tech.
In vitro MAO-A/B Inhibition Assay
IC50
4.13e+5± 4.34e+4 nM
Citation
 Jia, WZCheng, FZhang, YJGe, JYYao, SQZhu, Q Rapid synthesis of flavone-based monoamine oxidase (MAO) inhibitors targeting two active sites using click chemistry. Chem Biol Drug Des 89:141-151 (2017)  
Target
Name:
Amine oxidase [flavin-containing] B
Synonyms:
AOFB_HUMAN MAOB Monoamine oxidase type B (MAO B) Monoamine oxidase type B (MAOB)
Type:
Protein
Mol. Mass.:
58768.76
Organism:
Homo sapiens (Human)
Description:
P27338
Residue:
520
  
Inhibitor
Name:
BDBM206300
Synonyms:
5-(1-((4-oxo-2-phenyl-4H-chromen-6-yl)methyl)-1H-1,2,3-triazol-4-yl)-N-(p-tolyl)pentanamide (Az1k9)
Type:
Small organic molecule
Emp. Form.:
C30H28N4O3
Mol. Mass.:
492.5683
SMILES:
Cc1ccc(NC(=O)CCCCc2cn(Cc3ccc4oc(cc(=O)c4c3)-c3ccccc3)nn2)cc1
: