Target
Vascular endothelial growth factor receptor 2
Ligand
BDBM5364
Substrate
biotinylated synthetic peptide
Meas. Tech.
Homogeneous Time-resolved Fluorescence (HTRF) Assay
pH
7.5±n/a
Temperature
295.15±n/a K
IC50
1200±n/a nM
Citation
 Harris, PACheung, MHunter, RNBrown, MLVeal, JMNolte, RTWang, LLiu, WCrosby, RMJohnson, JHEpperly, AHKumar, RLuttrell, DKStafford, JA Discovery and evaluation of 2-anilino-5-aryloxazoles as a novel class of VEGFR2 kinase inhibitors. J Med Chem 48:1610-9 (2005)  
Target
Name:
Vascular endothelial growth factor receptor 2
Synonyms:
CD_antigen=CD309 Fetal liver kinase 1 (FLK-1) KDR Protein-tyrosine kinase receptor Flk-1 VEGFR-2 VEGFR2 Vascular Endothelial Growth Factor Receptor Kinase 2 Vascular endothelial growth factor receptor 2 (KDR) Vascular endothelial growth factor receptor 2 (VEGFR2) Vascular endothelial growth factor receptor-2 (VEGFR-2)
Type:
Receptor Tyrosine Kinase
Mol. Mass.:
151510.97
Organism:
Homo sapiens (Human)
Description:
P35968
Residue:
1356
  
Inhibitor
Name:
BDBM5364
Synonyms:
2-Anilino-5-aryloxazole 5 aminoxazole 24
Type:
Small organic molecule
Emp. Form.:
C15H12N2O
Mol. Mass.:
236.2686
SMILES:
N(c1ncc(o1)-c1ccccc1)c1ccccc1
:
Substrate
Name:
biotinylated synthetic peptide
Synonyms:
Type:
Peptide
Mol. Mass.:
3433.86
Organism:
Description:
75 uM ATP as co-substrate.
Residue:
28