Target
Vascular endothelial growth factor receptor 2
Ligand
BDBM5860
Substrate
biotinylated synthetic peptide
Meas. Tech.
Homogeneous Time-resolved Fluorescence (HTRF) Assay
pH
7.5±n/a
Temperature
295.15±n/a K
IC50
50±n/a nM
Citation
 Harris, PACheung, MHunter, RNBrown, MLVeal, JMNolte, RTWang, LLiu, WCrosby, RMJohnson, JHEpperly, AHKumar, RLuttrell, DKStafford, JA Discovery and evaluation of 2-anilino-5-aryloxazoles as a novel class of VEGFR2 kinase inhibitors. J Med Chem 48:1610-9 (2005)  
Target
Name:
Vascular endothelial growth factor receptor 2
Synonyms:
CD_antigen=CD309 Fetal liver kinase 1 (FLK-1) KDR Protein-tyrosine kinase receptor Flk-1 VEGFR-2 VEGFR2 Vascular Endothelial Growth Factor Receptor Kinase 2 Vascular endothelial growth factor receptor 2 (KDR) Vascular endothelial growth factor receptor 2 (VEGFR2) Vascular endothelial growth factor receptor-2 (VEGFR-2)
Type:
Receptor Tyrosine Kinase
Mol. Mass.:
151510.97
Organism:
Homo sapiens (Human)
Description:
P35968
Residue:
1356
  
Inhibitor
Name:
BDBM5860
Synonyms:
2-Anilino-5-aryloxazole 21 N-[5-(ethanesulfonyl)-2-methoxyphenyl]-5-phenyl-1,3-oxazol-2-amine
Type:
Small organic molecule
Emp. Form.:
C18H18N2O4S
Mol. Mass.:
358.412
SMILES:
CCS(=O)(=O)c1ccc(OC)c(Nc2ncc(o2)-c2ccccc2)c1
:
Substrate
Name:
biotinylated synthetic peptide
Synonyms:
Type:
Peptide
Mol. Mass.:
3433.86
Organism:
Description:
75 uM ATP as co-substrate.
Residue:
28