Target
cAMP and cAMP-inhibited cGMP 3',5'-cyclic phosphodiesterase 10A
Ligand
BDBM209736
Substrate
Meas. Tech.
PDE10 Fluorescence Polarization (FP) Assay
Temperature
298.15±n/a K
Ki
0.006±n/a nM
Comments
extracted
Citation
 Kuduk, SDMcComas, CCReger, TS Substituted pyridone derivatives as PDE10 inhibitors US Patent  US9273033 Publication Date 3/1/2016 
Target
Name:
cAMP and cAMP-inhibited cGMP 3',5'-cyclic phosphodiesterase 10A
Synonyms:
3',5'-cyclic phosphodiesterase PDE10_HUMAN Phosphodiesterase 10A
Type:
Protein
Mol. Mass.:
88412.52
Organism:
Homo sapiens (Human)
Description:
Q9Y233
Residue:
779
  
Inhibitor
Name:
BDBM209736
Synonyms:
US9273033, 34
Type:
Small organic molecule
Emp. Form.:
C25H24N4O2
Mol. Mass.:
412.4837
SMILES:
Cc1ncc(c(OC[C@H]2C[C@@H]2c2ccc3ccccc3n2)n1)-c1ccc(=O)n(C)c1C
: