Target
Ephrin type-A receptor 2 [596-900]
Ligand
BDBM50382959
Substrate
Meas. Tech.
HotSpot Kinase Activity Assay
IC50
28±0.0 nM
Citation
 Heinzlmeir, SKudlinzki, DSreeramulu, SKlaeger, SGande, SLLinhard, VWilhelm, MQiao, HHelm, DRuprecht, BSaxena, KMédard, GSchwalbe, HKuster, B Chemical Proteomics and Structural Biology Define EPHA2 Inhibition by Clinical Kinase Drugs. ACS Chem Biol 11:3400-3411 (2016)  
Target
Name:
Ephrin type-A receptor 2 [596-900]
Synonyms:
ECK EPHA2_HUMAN | Ephrin type-A receptor 2 (EPHA2)
Type:
Protein
Mol. Mass.:
34367.96
Organism:
Homo sapiens (Human)
Description:
EPHA2 truncation (596-900 aa); 519U
Residue:
305
  
Inhibitor
Name:
BDBM50382959
Synonyms:
CEP-32496 US9730937, Example 261
Type:
Small organic molecule
Emp. Form.:
C24H22F3N5O5
Mol. Mass.:
517.4572
SMILES:
COc1cc2ncnc(Oc3cccc(NC(=O)Nc4cc(on4)C(C)(C)C(F)(F)F)c3)c2cc1OC
: