Target
Ephrin type-A receptor 2 [596-900]
Ligand
BDBM50311316
Substrate
Meas. Tech.
HotSpot Kinase Activity Assay
IC50
4.1±0.0 nM
Citation
 Heinzlmeir, SKudlinzki, DSreeramulu, SKlaeger, SGande, SLLinhard, VWilhelm, MQiao, HHelm, DRuprecht, BSaxena, KMédard, GSchwalbe, HKuster, B Chemical Proteomics and Structural Biology Define EPHA2 Inhibition by Clinical Kinase Drugs. ACS Chem Biol 11:3400-3411 (2016)  
Target
Name:
Ephrin type-A receptor 2 [596-900]
Synonyms:
ECK EPHA2_HUMAN | Ephrin type-A receptor 2 (EPHA2)
Type:
Protein
Mol. Mass.:
34367.96
Organism:
Homo sapiens (Human)
Description:
EPHA2 truncation (596-900 aa); 519U
Residue:
305
  
Inhibitor
Name:
BDBM50311316
Synonyms:
CHEMBL1077739 N-(2-chlorophenyl)-6-(piperidin-4-yl)imidazo[1,2-a]pyridine-3-carboxamide, oxalate salt
Type:
Small organic molecule
Emp. Form.:
C19H19ClN4O
Mol. Mass.:
354.833
SMILES:
Clc1ccccc1NC(=O)c1cnc2ccc(cn12)C1CCNCC1
: