Target
Acetyl-CoA carboxylase 2 [129-967]
Ligand
BDBM212624
Substrate
Meas. Tech.
Spectrophotometric 384 Well Assay
pH
7.5±n/a
IC50
263±n/a nM
Comments
extracted
Citation
 Heine, NFleck, MNosse, BRoth, GJ Pyrrolidine derivatives, pharmaceutical compositions and uses thereof US Patent  US9278954 Publication Date 3/8/2016 
Target
Name:
Acetyl-CoA carboxylase 2 [129-967]
Synonyms:
ACACB ACC2 Acetyl-CoA carboxylase 2 (ACC2)
Type:
Enzyme
Mol. Mass.:
92599.28
Organism:
Homo sapiens (Human)
Description:
O00763 lacks the 128 amino acids at the N-terminus
Residue:
839
  
Inhibitor
Name:
BDBM212624
Synonyms:
US9278954, 1.15
Type:
Small organic molecule
Emp. Form.:
C24H27F4N3O3
Mol. Mass.:
481.4831
SMILES:
CC(C(=O)NCC(F)F)c1ccc(O[C@@H]2CCN(C2)c2ccc(OCC3CC3(F)F)cn2)cc1
: