Target
Guanine nucleotide-binding protein subunit alpha-15 [Y147C]/Metabotropic glutamate receptor 2
Ligand
BDBM213104
Substrate
Meas. Tech.
Biological Assay
IC50
6±n/a nM
Citation
 Bungard, CJConverso, AHanney, BHartingh, TJManley, PJMeissner, RSPerkins, JJRudd, MT Quinoline carboxamide and quinoline carbonitrile derivatives as mGluR2-negative allosteric modulators, compositions, and their use US Patent  US9278960 Publication Date 3/8/2016 
Target
Name:
Guanine nucleotide-binding protein subunit alpha-15 [Y147C]/Metabotropic glutamate receptor 2
Synonyms:
mGluR2 and G alpha 16
Type:
Protein
Mol. Mass.:
Description:
Components:
This complex has 2 components.
Component 1
Name:
Metabotropic glutamate receptor 2
Synonyms:
GPRC1B GRM2_HUMAN Metabotropic glutamate receptor mGlu2 | metabotropic glutamate 2
Type:
Enzyme
Mol. Mass.:
95584.88
Organism:
Homo sapiens (Human)
Description:
Q14416
Residue:
872
  
Component 2
Name:
Guanine nucleotide-binding protein subunit alpha-15 [Y147C]
Synonyms:
G protein alpha 16 GNA15_HUMAN | GNA16
Type:
Enzyme
Mol. Mass.:
43517.59
Organism:
Homo sapiens (Human)
Description:
P30679[Y147C]
Residue:
374
  
Inhibitor
Name:
BDBM213104
Synonyms:
US9278960, 8-10 | US9278960, 8-11
Type:
Small organic molecule
Emp. Form.:
C25H23FN4O2
Mol. Mass.:
430.4741
SMILES:
COc1ccc(c(F)c1)-c1cc(nc2cc(ccc12)C(C)Cc1cnc(C)nc1)C(N)=O
: