Target
Tyrosine-protein kinase ABL1 [64-515]
Ligand
BDBM213707
Substrate
Meas. Tech.
Caliper ABL
pH
7.5±n/a
Temperature
303.15±n/a K
IC50
0.3±n/a nM
Comments
extracted
Citation
 Furet, PGrotzfeld, RMJahnke, WJones, DBManley, PWMarzinzik, APelle, XFSalem, BSchoepfer, JSpieser, EA Compounds and compositions for inhibiting the activity of ABL1, ABL2 and BCR-ABL1 US Patent  US9278981 Publication Date 3/8/2016 
Target
Name:
Tyrosine-protein kinase ABL1 [64-515]
Synonyms:
ABL ABL1_HUMAN Tyrosine-protein kinase ABL1 Tyrosine-protein kinase ABL1 (ABL) | Tyrosine-protein kinase ABL1 (ABL1)
Type:
Enzyme Catalytic Domain
Mol. Mass.:
51539.77
Organism:
Homo sapiens (Human)
Description:
aa 64-515
Residue:
452
  
Inhibitor
Name:
BDBM213707
Synonyms:
US9278981, 299
Type:
Small organic molecule
Emp. Form.:
C24H20ClF2N5O4
Mol. Mass.:
515.897
SMILES:
COc1ncc(cc1C#N)-c1cc(cnc1N1CC[C@@H](O)C1)C(=O)Nc1ccc(OC(F)(F)Cl)cc1
: