Target
Tyrosine-protein kinase ABL1
Ligand
BDBM213623
Substrate
Meas. Tech.
Cellular Proliferation Assay
IC50
24.6±n/a nM
Citation
 Furet, PGrotzfeld, RMJahnke, WJones, DBManley, PWMarzinzik, APelle, XFSalem, BSchoepfer, JSpieser, EA Compounds and compositions for inhibiting the activity of ABL1, ABL2 and BCR-ABL1 US Patent  US9278981 Publication Date 3/8/2016 
Target
Name:
Tyrosine-protein kinase ABL1
Synonyms:
ABL ABL1_HUMAN JTK7 Proto-oncogene tyrosine-protein kinase ABL1 Tyrosine-protein kinase ABL V-abl Abelson murine leukemia viral oncogene homolog 1 p150 | tyrosine-protein kinase ABL1 isoform a
Type:
Enzyme
Mol. Mass.:
122897.30
Organism:
Homo sapiens (Human)
Description:
P00519
Residue:
1130
  
Inhibitor
Name:
BDBM213623
Synonyms:
US9278981, 215
Type:
Small organic molecule
Emp. Form.:
C22H21F2N5O3
Mol. Mass.:
441.4306
SMILES:
CC(F)(F)Oc1ccc(NC(=O)c2cnc(N3CC[C@@H](O)C3)c(c2)-c2cncnc2)cc1
: