Target
Tyrosine-protein kinase JAK3
Ligand
BDBM214690
Substrate
Meas. Tech.
Competition Binding Assay
Temperature
298.15±n/a K
Kd
21000±n/a nM
Comments
extracted
Citation
 Holladay, MWSetti, E Optically active pyrazolylaminoquinazoline, and pharmaceutical compositions and methods of use thereof US Patent  US9295672 Publication Date 3/29/2016 
Target
Name:
Tyrosine-protein kinase JAK3
Synonyms:
JAK-3 JAK3_HUMAN Janus kinase 3 (JAK3) L-JAK | Leukocyte janus kinase
Type:
Protein
Mol. Mass.:
125111.08
Organism:
Homo sapiens (Human)
Description:
P52333
Residue:
1124
  
Inhibitor
Name:
BDBM214690
Synonyms:
US9295672, (R)-(4-fluorophenyl)(4-((5-methyl-1H-pyrazol-3-yl)amino)quinazolin-2-yl)methanol
Type:
Small organic molecule
Emp. Form.:
C19H16FN5O
Mol. Mass.:
349.3616
SMILES:
Cc1cc(Nc2nc(nc3ccccc23)[C@H](O)c2ccc(F)cc2)n[nH]1
: