Target
Cytochrome P450 1A2
Ligand
BDBM214689
Substrate
BDBM50420191
Meas. Tech.
CYP450 Inhibition Assay
Temperature
310.15±n/a K
IC50
<310±n/a nM
Comments
extracted
Citation
 Holladay, MWSetti, E Optically active pyrazolylaminoquinazoline, and pharmaceutical compositions and methods of use thereof US Patent  US9295672 Publication Date 3/29/2016 
Target
Name:
Cytochrome P450 1A2
Synonyms:
CP1A2_HUMAN CYPIA2 Cytochrome P(3)450 Cytochrome P450 1A2 (CYP1A2) Cytochrome P450-P3
Type:
Enzyme
Mol. Mass.:
58423.38
Organism:
Homo sapiens (Human)
Description:
P05177
Residue:
516
  
Inhibitor
Name:
BDBM214689
Synonyms:
US9295672, (S)-(4-fluorophenyl)(4-((5-methyl-1H-pyrazol-3-yl)amino)quinazolin-2-yl)methanol
Type:
Small organic molecule
Emp. Form.:
C19H16FN5O
Mol. Mass.:
349.3616
SMILES:
Cc1cc(Nc2nc(nc3ccccc23)[C@@H](O)c2ccc(F)cc2)n[nH]1
:
Substrate
Name:
BDBM50420191
Synonyms:
ACETPHENETIDIN PHENACETIN
Type:
Small organic molecule
Emp. Form.:
C10H13NO2
Mol. Mass.:
179.2157
SMILES:
CCOc1ccc(NC(C)=O)cc1
: