Target
Cytochrome P450 2C8
Ligand
BDBM214689
Substrate
BDBM50001839
Meas. Tech.
CYP450 Inhibition Assay
Temperature
310.15±n/a K
IC50
22700±n/a nM
Comments
extracted
Citation
 Holladay, MWSetti, E Optically active pyrazolylaminoquinazoline, and pharmaceutical compositions and methods of use thereof US Patent  US9295672 Publication Date 3/29/2016 
Target
Name:
Cytochrome P450 2C8
Synonyms:
CP2C8_HUMAN CYPIIC8 P450 IIC2 P450 form 1 | S-mephenytoin 4-hydroxylase
Type:
Protein
Mol. Mass.:
55839.23
Organism:
Homo sapiens (Human)
Description:
P10632
Residue:
490
  
Inhibitor
Name:
BDBM214689
Synonyms:
US9295672, (S)-(4-fluorophenyl)(4-((5-methyl-1H-pyrazol-3-yl)amino)quinazolin-2-yl)methanol
Type:
Small organic molecule
Emp. Form.:
C19H16FN5O
Mol. Mass.:
349.3616
SMILES:
Cc1cc(Nc2nc(nc3ccccc23)[C@@H](O)c2ccc(F)cc2)n[nH]1
:
Substrate
Name:
BDBM50001839
Synonyms:
CHEMBL428647 taxol
Type:
Small organic molecule
Emp. Form.:
C47H51NO14
Mol. Mass.:
853.9061
SMILES:
CC(=O)O[C@@H]1C2=C(C)[C@H](C[C@@](O)([C@@H](OC(=O)c3ccccc3)[C@@H]3[C@@]4(CO[C@@H]4C[C@H](O)[C@@]3(C)C1=O)OC(C)=O)C2(C)C)OC(=O)[C@H](O)[C@@H](NC(=O)c1ccccc1)c1ccccc1
: