Target
Bifunctional epoxide hydrolase 2
Ligand
BDBM50327813
Substrate
Meas. Tech.
Fluorescent Based Assay
pH
7±n/a
IC50
3.1±n/a nM
Comments
extracted
Citation
 Hammock, BDRose, TMorisseau, CLee, KS Acyl piperidine inhibitors of soluble epoxide hydrolase US Patent  US9296693 Publication Date 3/29/2016 
Target
Name:
Bifunctional epoxide hydrolase 2
Synonyms:
Cytosolic epoxide hydrolase 2 EPHX2 HYES_HUMAN Soluble epoxide hydrolase (sEH) | epoxide hydrolase 2, cytoplasmic
Type:
Enzyme
Mol. Mass.:
62613.07
Organism:
Homo sapiens (Human)
Description:
P34913
Residue:
555
  
Inhibitor
Name:
BDBM50327813
Synonyms:
1-(((Pyridin-2-yl)acetyl)piperidin-4-yl)-3-(4-(trifluoromethoxy)phenyl)urea US9296693, 49
Type:
Small organic molecule
Emp. Form.:
C20H21F3N4O3
Mol. Mass.:
422.4009
SMILES:
FC(F)(F)Oc1ccc(NC(=O)NC2CCN(CC2)C(=O)Cc2ccccn2)cc1
: