Target
Lactoperoxidase
Ligand
BDBM217354
Substrate
Meas. Tech.
LPO/TPO Selectivity Assay
IC50
6.3e+3± 1e+2 nM
Citation
 Forbes, LVSjögren, TAuchère, FJenkins, DWThong, BLaughton, DHemsley, PPairaudeau, GTurner, REriksson, HUnitt, JFKettle, AJ Potent reversible inhibition of myeloperoxidase by aromatic hydroxamates. J Biol Chem 288:36636-47 (2013)  
Target
Name:
Lactoperoxidase
Synonyms:
LPO PERL_BOVIN
Type:
Enzyme
Mol. Mass.:
80659.97
Organism:
Bos taurus (Bovine)
Description:
P80025
Residue:
712
  
Inhibitor
Name:
BDBM217354
Synonyms:
2-(3,5-bistrifluoromethylbenzylamino)-6-oxo-1H-pyrimidine-5-carbohydroxamic acid (HX1)
Type:
Small organic molecule
Emp. Form.:
C14H10F6N4O3
Mol. Mass.:
396.2446
SMILES:
ONC(=O)c1cnc(NCc2cc(cc(c2)C(F)(F)F)C(F)(F)F)[nH]c1=O
: