Target
Glutathione S-transferase A1/Isoform 2 of MAP kinase-interacting serine/threonine-protein kinase 1 (MNK1a) [T344D]
Ligand
BDBM218686
Substrate
Meas. Tech.
MKNK1 Kinase High ATP Assay
pH
7.5±n/a
Temperature
295.15±n/a K
IC50
33±n/a nM
Comments
extracted
Citation
 Klar, UKettschau, GKosemund, DPühler, FEis, KLienau, PBömer, USülzle, DWortmann, L Substituted benzothienopyrimidines US Patent  US9296757 Publication Date 3/29/2016 
Target
Name:
Glutathione S-transferase A1/Isoform 2 of MAP kinase-interacting serine/threonine-protein kinase 1 (MNK1a) [T344D]
Synonyms:
GST-MKNK1 | Glutathione S-transferase A1/MAP kinase-interacting serine/threonine-protein kinase 1 (MNK1a) [T344D]
Type:
Enzyme
Mol. Mass.:
Description:
Components:
This complex has 2 components.
Component 1
Name:
Glutathione S-transferase A1
Synonyms:
GST class-alpha member 1 GSTA1 GSTA1_HUMAN Glutathione S-transferase (GST) | HA subunit 1
Type:
Enzyme
Mol. Mass.:
25636.31
Organism:
Homo sapiens (Human)
Description:
Glutathione-S-Transferase (GST, N-terminally)
Residue:
222
  
Component 2
Name:
Isoform 2 of MAP kinase-interacting serine/threonine-protein kinase 1 (MNK1a) 344D]
Synonyms:
Isoform 2 of MAP kinase-interacting serine/threonine-protein kinase 1 (MNK1a) 344D] MAP kinase signal-integrating kinase 1 (MNK1) (T344D) MAP kinase-interacting serine/threonine-protein kinase 1 (MKNK1) (T344D) MAP kinase-interacting serine/threonine-protein kinase 1 (MNK1a) [T344D] MKNK1 MKNK1_HUMAN MNK1a
Type:
Protein
Mol. Mass.:
47416.00
Organism:
Homo sapiens (Human)
Description:
Q9BUB5-2 with T344D
Residue:
424
  
Inhibitor
Name:
BDBM218686
Synonyms:
US9296757, 8
Type:
Small organic molecule
Emp. Form.:
C24H19N5O2S2
Mol. Mass.:
473.57
SMILES:
O=C(Nc1ccccc1)C1CCc2c(C1)sc1ncnc(Nc3ccc4[nH]c(=O)sc4c3)c21
: