Target
Casein kinase II subunit beta
Ligand
BDBM218988
Substrate
BDBM220103
Meas. Tech.
Inhibition Assay
pH
7±n/a
IC50
700.8±n/a nM
Comments
extracted
Citation
 Haddach, MTran, JAPierre, FRegan, CFRaffaele, NRavula, SRyckman, DM Pyrazolopyrimidines and related heterocycles as CK2 inhibitors US Patent  US9303033 Publication Date 4/5/2016 
Target
Name:
Casein kinase II subunit beta
Synonyms:
CK2N CSNK2B Casein kinase II subunit beta (CK2 beta) G5A | Serine/threonine-protein kinase pim-2
Type:
Enzyme
Mol. Mass.:
24937.13
Organism:
Homo sapiens (Human)
Description:
P67870
Residue:
215
  
Inhibitor
Name:
BDBM218988
Synonyms:
US9303033, P6, Table 19A, Compound 15
Type:
Small organic molecule
Emp. Form.:
C20H19ClN8O2
Mol. Mass.:
438.87
SMILES:
Clc1cccc(Nc2cc(NC3CCNC3)n3ncc(\C=C4/NC(=O)NC4=O)c3n2)c1
:
Substrate
Name:
BDBM220103
Synonyms:
US9303033, RSRSSYPAGT
Type:
Peptide Substrate
Emp. Form.:
C44H77N16O15
Mol. Mass.:
1070.1798
SMILES:
CC(O)C(NC(=O)CNC(=O)[C@H](C)NC(=O)[C@@H]1CCCN1C(=O)[C@H](Cc1ccc(O)cc1)NC(=O)[C@H](CO)NC(=O)[C@H](CO)NC(=O)[C@H](CCCNC(N)N)NC(=O)[C@H](CO)NC(=O)[C@@H]([NH3+])CCCNC(N)N)C=O
: