Target
Aldo-keto reductase family 1 member C3
Ligand
BDBM220116
Substrate
Meas. Tech.
Discontinuous Radiometric Assay
Ki
6000±n/a nM
Citation
 Penning, TMAdeniji, AOBurns, MCWinkler, JTwenter, B Bifunctional AKR1C3 inhibitors/androgen receptor modulators and methods of use thereof US Patent  US9271961 Publication Date 3/1/2016 
Target
Name:
Aldo-keto reductase family 1 member C3
Synonyms:
17-beta-Hydroxysteroid Dehydrogenase 5 (17-beta-HSD5, AKR1C3) AK1C3_HUMAN Aldo-keto reductase family 1 member C3 Aldo-keto reductase family 1 member C3 (AK1C3a) Aldo-keto-reductase family 1 member C3 Dihydrodiol dehydrogenase 3 Estradiol 17-beta-dehydrogenase KIAA0119 Prostaglandin F synthase Trans-1,2-dihydrobenzene-1,2-diol dehydrogenase
Type:
Enzyme
Mol. Mass.:
36859.86
Organism:
Homo sapiens (Human)
Description:
P42330
Residue:
323
  
Inhibitor
Name:
BDBM220116
Synonyms:
US9271961, CBM
Type:
Small organic molecule
Emp. Form.:
C19H17ClN2O3
Mol. Mass.:
356.803
SMILES:
COc1ccc2n(cc(CNC(C)=O)c2c1)C(=O)c1ccc(Cl)cc1
: