Target
Bromodomain-containing protein 4 [57-168]
Ligand
BDBM220520
Substrate
Meas. Tech.
Bromodomain Domain Binding Assay
pH
6±n/a
Temperature
298.15±n/a K
Ki
0.72±n/a nM
Comments
extracted
Citation
 Wang, LPratt, JKMcDaniel, KFDai, YFidanze, SDHasvold, LHolms, JHKati, WMLiu, DMantei, RAMcClellan, WJSheppard, GSWada, CK Bromodomain inhibitors US Patent  US9296741 Publication Date 3/29/2016 
Target
Name:
Bromodomain-containing protein 4 [57-168]
Synonyms:
BRD4 Bromodomain-containing protein 4 (BRD4) Bromodomain-containing protein 4 (BRD4-BD1) | HUNK1
Type:
Enzyme Catalytic Domain
Mol. Mass.:
13496.03
Organism:
Homo sapiens (Human)
Description:
BDI: amino acids K57-E168
Residue:
112
  
Inhibitor
Name:
BDBM220520
Synonyms:
US9296741, 109
Type:
Small organic molecule
Emp. Form.:
C21H25N3O5S
Mol. Mass.:
431.505
SMILES:
CCS(=O)(=O)Nc1ccc(OC2CCOCC2)c(c1)-c1cn(C)c(=O)c2[nH]ccc12
: