Target
Bromodomain-containing protein 4 [352-457]
Ligand
BDBM220495
Substrate
Meas. Tech.
Bromodomain Domain Binding Assay
pH
6±n/a
Temperature
298.15±n/a K
Ki
0.65±n/a nM
Comments
extracted
Citation
 Wang, LPratt, JKMcDaniel, KFDai, YFidanze, SDHasvold, LHolms, JHKati, WMLiu, DMantei, RAMcClellan, WJSheppard, GSWada, CK Bromodomain inhibitors US Patent  US9296741 Publication Date 3/29/2016 
Target
Name:
Bromodomain-containing protein 4 [352-457]
Synonyms:
BRD4 Bromodomain-containing protein 4 (BRD4) Bromodomain-containing protein 4 (BRD4-BD2) | HUNK1
Type:
Enzyme Catalytic Domain
Mol. Mass.:
12432.37
Organism:
Homo sapiens (Human)
Description:
BDII: amino acid E352-M457
Residue:
106
  
Inhibitor
Name:
BDBM220495
Synonyms:
US9296741, 84
Type:
Small organic molecule
Emp. Form.:
C23H22N4O5S
Mol. Mass.:
466.51
SMILES:
CCS(=O)(=O)Nc1ccc(Oc2ccc(cc2)C(N)=O)c(c1)-c1cn(C)c(=O)c2[nH]ccc12
: