Target
Diacylglycerol O-acyltransferase 1
Ligand
BDBM220967
Substrate
Meas. Tech.
DGAT1 Inhibitory Assay
pH
7.4±n/a
Temperature
303.15±n/a K
IC50
3±n/a nM
Comments
extracted
Citation
 Sakurai, OSaruta, KHayashi, NGoi, TMorokuma, KTsujishima, HSawamoto, HShitama, HImashiro, R Continuous arycyclic compound US Patent  US9302996 Publication Date 4/5/2016 
Target
Name:
Diacylglycerol O-acyltransferase 1
Synonyms:
ACAT-related gene product 1 Acyl coA-diacylglycerol acyl transferase 1 (DGAT1) DGAT1 Diacylglycerol Acyltransferase (DGAT1) Diacylglycerol O-acyltransferase 1 (DGAT1) | Diglyceride acyltransferase
Type:
Protein
Mol. Mass.:
55297.82
Organism:
Homo sapiens (Human)
Description:
O75907
Residue:
488
  
Inhibitor
Name:
BDBM220967
Synonyms:
US9302996, 82
Type:
Small organic molecule
Emp. Form.:
C20H16ClF4N3O3
Mol. Mass.:
457.806
SMILES:
CC(C)(COc1ncc(cc1F)-c1ccc(-c2ncc([nH]2)C(F)(F)F)c(Cl)c1)C(O)=O
: