Target
Diacylglycerol O-acyltransferase 1
Ligand
BDBM220886
Substrate
Meas. Tech.
DGAT1 Inhibitory Assay
pH
7.4±n/a
Temperature
303.15±n/a K
IC50
1.4±n/a nM
Comments
extracted
Citation
 Sakurai, OSaruta, KHayashi, NGoi, TMorokuma, KTsujishima, HSawamoto, HShitama, HImashiro, R Continuous arycyclic compound US Patent  US9302996 Publication Date 4/5/2016 
Target
Name:
Diacylglycerol O-acyltransferase 1
Synonyms:
ACAT-related gene product 1 Acyl coA-diacylglycerol acyl transferase 1 (DGAT1) DGAT1 Diacylglycerol Acyltransferase (DGAT1) Diacylglycerol O-acyltransferase 1 (DGAT1) | Diglyceride acyltransferase
Type:
Protein
Mol. Mass.:
55297.82
Organism:
Homo sapiens (Human)
Description:
O75907
Residue:
488
  
Inhibitor
Name:
BDBM220886
Synonyms:
US9302996, 1-3
Type:
Small organic molecule
Emp. Form.:
C20H18F3N3O3
Mol. Mass.:
405.3704
SMILES:
CC(C)(COc1ccc(cc1)-c1ccc(cn1)-c1nc(c[nH]1)C(F)(F)F)C(O)=O
: