Target
5-hydroxytryptamine receptor 3A
Ligand
BDBM221550
Substrate
Meas. Tech.
In Vitro Inhibition of Ca Flux Assay
Temperature
310.15±n/a K
IC50
0.5±n/a nM
Comments
extracted
Citation
 Hitchcock, SMonenschein, HReichard, HSun, HKikuchi, SMacklin, THopkins, M 5-HT3 receptor antagonists US Patent  US9303045 Publication Date 4/5/2016 
Target
Name:
5-hydroxytryptamine receptor 3A
Synonyms:
5-HT-3 5-HT3A 5-hydroxytryptamine receptor 3 (5-HT3) 5-hydroxytryptamine receptor 3A (5HT3A) 5HT3R HTR3A Serotonin 3 receptor (5HT3) Serotonin-gated ion channel receptor | Serotonin-gated ion channel receptor 3
Type:
Protein
Mol. Mass.:
55283.27
Organism:
Homo sapiens (Human)
Description:
P46098
Residue:
478
  
Inhibitor
Name:
BDBM221550
Synonyms:
US9303045, 36 | US9695195, 36
Type:
Small organic molecule
Emp. Form.:
C18H22FN3O4S
Mol. Mass.:
395.448
SMILES:
CN1C2COCC1CC(C2)NC(=O)c1cn(c2ccc(F)cc12)S(C)(=O)=O
: