Target
Carbonic anhydrase 2
Ligand
BDBM222046
Substrate
Meas. Tech.
Esterase Activity Assay
pH
7.4±n/a
Temperature
298.15±n/a K
Ki
0.2773±0.0301 nM
IC50
0.3561±0.0 nM
Comments
extracted
Citation
 Kocyigit, UMBudak, YGürdere, MBTekin, Å¿Köprülü, TKErtürk, FÖzcan, KGülçin, Ä°Ceylan, M Synthesis, characterization, anticancer, antimicrobial and carbonic anhydrase inhibition profiles of novel (3aR,4S,7R,7aS)-2-(4-((E)-3-(3-aryl)acryloyl) phenyl)-3a,4,7,7a-tetrahydro-1H-4,7-methanoisoindole-1,3(2H)-dione derivatives. Bioorg Chem 70:118-125 (2017)  
Target
Name:
Carbonic anhydrase 2
Synonyms:
CA-II CAC Carbonate dehydratase II Carbonic anhydrase 2 (CA-II) Carbonic anhydrase C Carbonic anhydrase II (CA-II) Carbonic anhydrase II (hCA II) | Carbonic anhydrase isoenzyme II (hCA II)
Type:
Enzyme
Mol. Mass.:
29250.71
Organism:
Homo sapiens (Human)
Description:
P00918
Residue:
260
  
Inhibitor
Name:
BDBM222046
Synonyms:
(3aR,4S,7R,7aS)-2-(4-((E)-3-(4-methoxyphenyl)acryloyl)phenyl)-3a,4,7,7a-tetrahydro-1H-4,7-methanoisoindole-1,3(2H)-dione (7a)
Type:
Small organic molecule
Emp. Form.:
C25H21NO4
Mol. Mass.:
399.4385
SMILES:
COc1ccc(\C=C\C(=O)c2ccc(cc2)N2C(=O)[C@H]3[C@@H]4C[C@@H](C=C4)[C@H]3C2=O)cc1
: