Target
Prostaglandin G/H synthase 2
Ligand
BDBM222293
Substrate
Meas. Tech.
In Vitro COX Inhibition Assay
Kd
14.01±0.0 nM
Citation
 Singh, JSaini, VKumar, ABansal, R Synthesis, molecular docking and biological evaluation of some newer 2-substituted-4-(benzo[d][1,3]dioxol-5-yl)-6-phenylpyridazin-3(2H)-ones as potential anti-inflammatory and analgesic agents. Bioorg Chem 71:201-210 (2017)  
Target
Name:
Prostaglandin G/H synthase 2
Synonyms:
COX2 Cyclooxygenase 2 (COX-2) Cyclooxygenase-2 (COX-2 AA) Cyclooxygenase-2 (COX-2) PGH2_HUMAN PHS II Prostaglandin E synthase/G/H synthase 2 Prostaglandin-endoperoxide synthase 2
Type:
Enzyme
Mol. Mass.:
69003.89
Organism:
Homo sapiens (Human)
Description:
Recombinant Cox-2 provided by Cayman (Cayman Chemical Co.,Ann Arbor, MI).
Residue:
604
  
Inhibitor
Name:
BDBM222293
Synonyms:
4-(Benzo[d][1,3]dioxol-5-yl)-2-(2-(3,4-dimethoxyphenethylamine)-2-oxoethyl)-6-phenyl-pyridazin-3(2H)-one (11)
Type:
Small organic molecule
Emp. Form.:
C29H27N3O6
Mol. Mass.:
513.5412
SMILES:
COc1ccc(CCNC(=O)Cn2nc(cc(-c3ccc4OCOc4c3)c2=O)-c2ccccc2)cc1OC
: