Target
Amine oxidase [flavin-containing] B
Ligand
BDBM222338
Substrate
Meas. Tech.
MAO-A/MAO-B Inhibition Assay
pH
7.4±n/a
IC50
37720±1360 nM
Comments
extracted
Citation
 Yang, XQiang, XLi, YLuo, LXu, RZheng, YCao, ZTan, ZDeng, Y Pyridoxine-resveratrol hybrids Mannich base derivatives as novel dual inhibitors of AChE and MAO-B with antioxidant and metal-chelating properties for the treatment of Alzheimer's disease. Bioorg Chem 71:305-314 (2017)  
Target
Name:
Amine oxidase [flavin-containing] B
Synonyms:
AOFB_HUMAN MAOB Monoamine oxidase type B (MAO B) Monoamine oxidase type B (MAOB)
Type:
Protein
Mol. Mass.:
58768.76
Organism:
Homo sapiens (Human)
Description:
P27338
Residue:
520
  
Inhibitor
Name:
BDBM222338
Synonyms:
(E)-5-(3-hydroxy-4-((4-methylpiperazin-1-yl)methyl)styryl)-4-(hydroxymethyl)-2-methylpyridn-3-ol (7f)
Type:
Small organic molecule
Emp. Form.:
C21H27N3O3
Mol. Mass.:
369.4574
SMILES:
CN1CCN(Cc2ccc(\C=C\c3cnc(C)c(O)c3CO)cc2O)CC1
: