Target
Cholesteryl ester transfer protein
Ligand
BDBM192298
Substrate
Meas. Tech.
CETP Inhibition Assay
Temperature
310.15±n/a K
IC50
22.9±n/a nM
Comments
extracted
Citation
 Kawai, YIwase, NKikuchi, OTakata, KMotoyama, THagihara, M Acid addition salt of substituted pyridine compound US Patent  US9321747 Publication Date 4/26/2016 
Target
Name:
Cholesteryl ester transfer protein
Synonyms:
CETP Cholesteryl ester transfer protein (CETP) | Lipid transfer protein I
Type:
Enzyme
Mol. Mass.:
54751.53
Organism:
Homo sapiens (Human)
Description:
P11597
Residue:
493
  
Inhibitor
Name:
BDBM192298
Synonyms:
US9187450, 45 | US9321747, 19
Type:
Small organic molecule
Emp. Form.:
C38H46F6N4O4S
Mol. Mass.:
768.852
SMILES:
CC1(C)C[C@H](O)c2c(C1)nc(C1CCN(CC1)c1ncc(OCCCS(C)(=O)=O)cn1)c([C@@H](F)c1ccc(cc1)C(F)(F)F)c2C1CCC(F)(F)CC1
: