Target
Intestinal-type alkaline phosphatase
Ligand
BDBM18073
Substrate
Meas. Tech.
Alkaline Phosphatase Inhibition Assay
pH
9.8±n/a
Temperature
310.15±n/a K
IC50
80200±1.0 nM
Comments
extracted
Citation
 Channar, PAShah, SJHassan, SNisa, ZULecka, JSévigny, JBajorath, JSaeed, AIqbal, J Isonicotinohydrazones as inhibitors of alkaline phosphatase and ecto-5'-nucleotidase. Chem Biol Drug Des 89:365-370 (2017)  
Target
Name:
Intestinal-type alkaline phosphatase
Synonyms:
ALPI Intestinal alkaline phosphatase (IAP) PPBI_BOVIN
Type:
Protein
Mol. Mass.:
57094.82
Organism:
Bos taurus (Cattle)
Description:
P19111
Residue:
533
  
Inhibitor
Name:
BDBM18073
Synonyms:
(2S)-2-amino-3-phenylpropanoic acid L-[2,3,4,5,6-3H]phenylalanine Phenylalanine | US11021454, Compound L-phe
Type:
Amino Acid
Emp. Form.:
C9H11NO2
Mol. Mass.:
165.1891
SMILES:
N[C@@H](Cc1ccccc1)C(O)=O
: