Target
Epithelial discoidin domain-containing receptor 1
Ligand
BDBM223081
Substrate
Meas. Tech.
LanthaScreen Eu Kinase Activity Assay
pH
7.5±n/a
Temperature
298.15±n/a K
IC50
4.32±0.65 nM
Comments
extracted
Citation
 Liu, LHussain, MLuo, JDuan, AChen, CTu, ZZhang, J Synthesis and biological evaluation of novel dasatinib analogues as potent DDR1 and DDR2 kinase inhibitors. Chem Biol Drug Des 89:420-427 (2017)  
Target
Name:
Epithelial discoidin domain-containing receptor 1
Synonyms:
CAK DDR1_HUMAN Discoidin domain-containing receptor 1 (DDR1) EDDR1 Epithelial discoidin domain receptor 1 (DDR1) Epithelial discoidin domain-containing receptor 1 (DDR1) Mammary carcinoma kinase 10 NTRK4 Protein-tyrosine kinase RTK 6 TRKE | Tyrosine-protein kinase CAK
Type:
Tyrosine-protein kinase
Mol. Mass.:
101130.02
Organism:
Homo sapiens (Human)
Description:
Q08345
Residue:
913
  
Inhibitor
Name:
BDBM223081
Synonyms:
Methyl 4-(6-((5-((2-chloro-6-methylphenyl)carbamoyl)thiazol-2-yl)amino)-2-methylpyrimidin-4-yl)-piperazine-1-carboxylate (3a)
Type:
Small organic molecule
Emp. Form.:
C22H24ClN7O3S
Mol. Mass.:
501.989
SMILES:
COC(=O)N1CCN(CC1)c1cc(Nc2ncc(s2)C(=O)Nc2c(C)cccc2Cl)nc(C)n1
: