Target
Alpha-glucosidase MAL32
Ligand
BDBM223107
Substrate
Meas. Tech.
In Vitro α-Glucosidase Inhibitory Assay
pH
6.8±n/a
IC50
114410±2140 nM
Comments
extracted
Citation
 Wang, GWang, JHe, DLi, XLi, JPeng, Z Synthesis, in vitro evaluation and molecular docking studies of novel coumarin-isatin derivatives as a-glucosidase inhibitors. Chem Biol Drug Des 89:456-463 (2017)  
Target
Name:
Alpha-glucosidase MAL32
Synonyms:
Alpha-glucosidase MAL32 MAL32_YEAST Maltase alpha-Glucosidase (alpha-Glu) | alpha-Glucosidase (α-Glucosidase)
Type:
Hydrolase
Mol. Mass.:
68132.36
Organism:
Saccharomyces cerevisiae
Description:
Purchased from Wako Fine Chemicals Co. Ltd.
Residue:
584
  
Inhibitor
Name:
BDBM223107
Synonyms:
(Z)-N'-(5-methyl-2-oxoindolin-3-ylidene)-2-((2-oxo-2H-chromen-7-yl)oxy)acetohydrazide (5b)
Type:
Small organic molecule
Emp. Form.:
C20H15N3O5
Mol. Mass.:
377.3502
SMILES:
Cc1ccc2NC(=O)\C(=N/NC(=O)COc3ccc4ccc(=O)oc4c3)c2c1
: