Target
Lysine-specific demethylase 6B
Ligand
BDBM223318
Substrate
Meas. Tech.
AlphaScreen Assay
IC50
8e+3±2.6e+3 nM
Citation
 Tumber, ANuzzi, AHookway, ESHatch, SBVelupillai, SJohansson, CKawamura, ASavitsky, PYapp, CSzykowska, AWu, NBountra, CStrain-Damerell, CBurgess-Brown, NARuda, GFFedorov, OMunro, SEngland, KSNowak, RPSchofield, CJLa Thangue, NBPawlyn, CDavies, FMorgan, GAthanasou, NMüller, SOppermann, UBrennan, PE Potent and Selective KDM5 Inhibitor Stops Cellular Demethylation of H3K4me3 at Transcription Start Sites and Proliferation of MM1S Myeloma Cells. Cell Chem Biol 24:371-380 (2017)  
Target
Name:
Lysine-specific demethylase 6B
Synonyms:
JMJD3 Jumonji domain-containing protein 3 KDM6B_HUMAN Lysine demethylase 6B Lysine-specific demethylase 6B (KDM6B(JMJD3)) | Lysine-specific demethylase 6B (KDM6B)
Type:
Protein
Mol. Mass.:
176672.55
Organism:
Homo sapiens (Human)
Description:
O15054
Residue:
1643
  
Inhibitor
Name:
BDBM223318
Synonyms:
KDOAM-28
Type:
Small organic molecule
Emp. Form.:
C17H29N5O2
Mol. Mass.:
335.4445
SMILES:
CCNC(=O)c1ccnc(CNCC(=O)N(CC)CCN(C)C)c1
: