Target
Aldehyde dehydrogenase, mitochondrial
Ligand
BDBM223458
Substrate
BDBM60952
Meas. Tech.
Inhibiton Assay
pH
7.5±n/a
IC50
1200±n/a nM
Comments
extracted
Citation
 Hurley, TD Regulators of aldehyde dehydrogenase ALDH3A1 and related therapeutic methods US Patent  US9320722 Publication Date 4/26/2016 
Target
Name:
Aldehyde dehydrogenase, mitochondrial
Synonyms:
ALDH class 2 ALDH2 ALDHI Aldehyde dehydrogenase (ALDH2)
Type:
Enzyme
Mol. Mass.:
56382.67
Organism:
Homo sapiens (Human)
Description:
P05091
Residue:
517
  
Inhibitor
Name:
BDBM223458
Synonyms:
US9320722, CD5
Type:
Small organic molecule
Emp. Form.:
C20H18N4O3S
Mol. Mass.:
394.447
SMILES:
CCSc1nnc-2c(OC(Nc3ccccc-23)C(=O)c2ccc(OC)cc2)n1
:
Substrate
Name:
BDBM60952
Synonyms:
propionaldehyde
Type:
Emp. Form.:
C3H6O
Mol. Mass.:
58.0791
SMILES:
CCC=O
: