Target
RAC-alpha serine/threonine-protein kinase [1-123]
Ligand
BDBM50304368
Substrate
Meas. Tech.
SPR Competitive Binding Assay
Kd
19600±4900 nM
Citation
 Mahadevan, DMeuillet, EJMash, Jr., EAGokhale, VMPowis, GZhang, S Small molecule inhibitors of the pleckstrin homology domain and methods for using same US Patent  US9320734 Publication Date 4/26/2016 
Target
Name:
RAC-alpha serine/threonine-protein kinase [1-123]
Synonyms:
AKT1 PKB RAC-alpha serine/threonine-protein kinase (Akt)
Type:
Enzyme
Mol. Mass.:
14664.42
Organism:
Homo sapiens (Human)
Description:
PLECKSTRIN HOMOLOGY DOMAIN RESIDUES 1-123 (PH Domain)
Residue:
123
  
Inhibitor
Name:
BDBM50304368
Synonyms:
CHEMBL595582 US9320734, 101
Type:
Small organic molecule
Emp. Form.:
C18H26N4O3S2
Mol. Mass.:
410.554
SMILES:
CCCCCCCCCC(=O)Nc1ccc(cc1)S(=O)(=O)Nc1nncs1
: