Target
RAC-alpha serine/threonine-protein kinase [1-123]
Ligand
BDBM50338949
Substrate
Meas. Tech.
SPR Competitive Binding Assay
Ki
6700±n/a nM
Citation
 Mahadevan, DMeuillet, EJMash, Jr., EAGokhale, VMPowis, GZhang, S Small molecule inhibitors of the pleckstrin homology domain and methods for using same US Patent  US9320734 Publication Date 4/26/2016 
Target
Name:
RAC-alpha serine/threonine-protein kinase [1-123]
Synonyms:
AKT1 PKB RAC-alpha serine/threonine-protein kinase (Akt)
Type:
Enzyme
Mol. Mass.:
14664.42
Organism:
Homo sapiens (Human)
Description:
PLECKSTRIN HOMOLOGY DOMAIN RESIDUES 1-123 (PH Domain)
Residue:
123
  
Inhibitor
Name:
BDBM50338949
Synonyms:
4-Tetradecyl-N-(1,3,4-thiadiazol-2-yl)benzenesulfonamide US9320734, 156
Type:
Small organic molecule
Emp. Form.:
C22H35N3O2S2
Mol. Mass.:
437.662
SMILES:
CCCCCCCCCCCCCCc1ccc(cc1)S(=O)(=O)Nc1nncs1
: