Target
Mas-related G-protein coupled receptor member X2
Ligand
BDBM82507
Substrate
Meas. Tech.
PRESTO-Tango Assay
pH
7.4±0
Temperature
303.15±0 K
EC50
4.4e+4±1.3e+4 nM
Citation
 Lansu, KKarpiak, JLiu, JHuang, XPMcCorvy, JDKroeze, WKChe, TNagase, HCarroll, FIJin, JShoichet, BKRoth, BL In silico design of novel probes for the atypical opioid receptor MRGPRX2. Nat Chem Biol 13:529-536 (2017)  
Target
Name:
Mas-related G-protein coupled receptor member X2
Synonyms:
MRGPRX2 MRGX2_HUMAN Mas-related G-protein coupled receptor member X2
Type:
GPCR
Mol. Mass.:
37104.79
Organism:
Homo sapiens (Human)
Description:
Q96LB1
Residue:
330
  
Inhibitor
Name:
BDBM82507
Synonyms:
(+/-)-Methadone METHADONE NSC_22266
Type:
Small organic molecule
Emp. Form.:
C21H27NO
Mol. Mass.:
309.4452
SMILES:
CCC(=O)C(CC(C)N(C)C)(c1ccccc1)c1ccccc1
: