Target
Poly [ADP-ribose] polymerase 1
Ligand
BDBM224630
Substrate
Meas. Tech.
HT F Homogeneous PARP Inhibition Assay
pH
8±n/a
IC50
5.9±n/a nM
Comments
extracted
Citation
 Zhou, CRen, BWang, H Substituted cycloocta[5,6]pyrido[4,3,2-de]phthalazines as PARP inhibitors US Patent  US9328111 Publication Date 5/3/2016 
Target
Name:
Poly [ADP-ribose] polymerase 1
Synonyms:
(ARTD1 or PARP1) 2.4.2.30 ADPRT ARTD1 Human diphtheria toxin-like ADP-ribosyltransferase (ARTD1 or PARP1) NT-PARP-1 PARP1 PPOL Poly [ADP-ribose] polymerase 1 (PARP) Poly [ADP-ribose] polymerase 1 (PARP1) Poly [ADP-ribose] polymerase 1, 28-kDa form Poly [ADP-ribose] polymerase 1, processed C-terminus Poly [ADP-ribose] polymerase-1 Poly(ADP-ribose) polymerase-1 (ARTD1/PARP1) Protein poly-ADP-ribosyltransferase PARP1 | Synonyms=ADPRT
Type:
Mol. Mass.:
113114.22
Organism:
Homo sapiens (Human)
Description:
P09874
Residue:
1014
  
Inhibitor
Name:
BDBM224630
Synonyms:
US9328111, 3
Type:
Small organic molecule
Emp. Form.:
C16H17N3O
Mol. Mass.:
267.3257
SMILES:
O=c1[nH]nc2c3CCCCCCc3[nH]c3cccc1c23
: