Target
Poly [ADP-ribose] polymerase 2
Ligand
BDBM224630
Substrate
Meas. Tech.
Chemiluminescent Assay
IC50
25±n/a nM
Citation
 Zhou, CRen, BWang, H Substituted cycloocta[5,6]pyrido[4,3,2-de]phthalazines as PARP inhibitors US Patent  US9328111 Publication Date 5/3/2016 
Target
Name:
Poly [ADP-ribose] polymerase 2
Synonyms:
(ARTD2 or PARP2) ADPRTL2 PARP2_HUMAN Poly [ADP-ribose] polymerase 2 (PARP2)
Type:
Enzyme
Mol. Mass.:
66225.70
Organism:
Homo sapiens (Human)
Description:
Q9UGN5
Residue:
583
  
Inhibitor
Name:
BDBM224630
Synonyms:
US9328111, 3
Type:
Small organic molecule
Emp. Form.:
C16H17N3O
Mol. Mass.:
267.3257
SMILES:
O=c1[nH]nc2c3CCCCCCc3[nH]c3cccc1c23
: