Target
Cyclin-dependent kinase 2
Ligand
BDBM225313
Substrate
Meas. Tech.
OctetRed_Method2
Kd
>100000±n/a nM
Citation
 D3R, DD CSAR CDK2-CyclinA D3R 219:0 (2015) Target
Name:
Cyclin-dependent kinase 2
Synonyms:
CDK2 CDK2_HUMAN Cell division protein kinase 2 Protein cereblon/Cyclin-dependent kinase 2 | p33 protein kinase
Type:
Enzyme Subunit
Mol. Mass.:
33938.17
Organism:
Homo sapiens (Human)
Description:
P24941
Residue:
298
  
Inhibitor
Name:
BDBM225313
Synonyms:
CS5
Type:
Small Organic Molecule
Emp. Form.:
C16H18BrN3O
Mol. Mass.:
348.238
SMILES:
Brc1ccc(cc1)C(=O)Nc1cc([nH]n1)C1CCCCC1
: