Target
Cyclin-dependent kinase 2
Ligand
BDBM8043
Substrate
Meas. Tech.
OctetRed_Method2
Kd
151±55.9 nM
Citation
 D3R, DD CSAR CDK2-CyclinA D3R 219:0 (2015) Target
Name:
Cyclin-dependent kinase 2
Synonyms:
CDK2 CDK2_HUMAN Cell division protein kinase 2 Protein cereblon/Cyclin-dependent kinase 2 | p33 protein kinase
Type:
Enzyme Subunit
Mol. Mass.:
33938.17
Organism:
Homo sapiens (Human)
Description:
P24941
Residue:
298
  
Inhibitor
Name:
BDBM8043
Synonyms:
(4-chlorophenyl)-[4-(2,4-dimethylthiazol-5-yl)pyrimidin-2-yl]amine CS13 | N-(4-chlorophenyl)-4-(2,4-dimethyl-1,3-thiazol-5-yl)pyrimidin-2-amine
Type:
Small organic molecule
Emp. Form.:
C15H13ClN4S
Mol. Mass.:
316.809
SMILES:
Cc1nc(C)c(s1)-c1ccnc(Nc2ccc(Cl)cc2)n1
: