Target
Cyclin-dependent kinase 2
Ligand
BDBM225318
Substrate
Meas. Tech.
OctetRed_Method2
Kd
333±108 nM
Citation
 D3R, DD CSAR CDK2-CyclinA D3R 219:0 (2015) Target
Name:
Cyclin-dependent kinase 2
Synonyms:
CDK2 CDK2_HUMAN Cell division protein kinase 2 Protein cereblon/Cyclin-dependent kinase 2 | p33 protein kinase
Type:
Enzyme Subunit
Mol. Mass.:
33938.17
Organism:
Homo sapiens (Human)
Description:
P24941
Residue:
298
  
Inhibitor
Name:
BDBM225318
Synonyms:
CS244
Type:
Small Organic Molecule
Emp. Form.:
C24H20N4O5S2
Mol. Mass.:
508.569
SMILES:
COc1cccc(OC)c1NS(=O)(=O)c1ccc(N\C=C2/C(=O)Nc3ccc4ncsc4c23)cc1
: