Target
Cyclin-dependent kinase 2
Ligand
BDBM91799
Substrate
Meas. Tech.
OctetRed_Method1
Kd
>100000±n/a nM
Citation
 D3R, DD CSAR CDK2-CyclinA D3R 219:0 (2015) Target
Name:
Cyclin-dependent kinase 2
Synonyms:
CDK2 CDK2_HUMAN Cell division protein kinase 2 Protein cereblon/Cyclin-dependent kinase 2 | p33 protein kinase
Type:
Enzyme Subunit
Mol. Mass.:
33938.17
Organism:
Homo sapiens (Human)
Description:
P24941
Residue:
298
  
Inhibitor
Name:
BDBM91799
Synonyms:
CS58
Type:
Emp. Form.:
C20H19N5O4S
Mol. Mass.:
425.461
SMILES:
[O-][N+](=O)c1ccc(cc1)-c1nnc(SCC(=O)N2CCOCC2)n1-c1ccccc1
: