Target
Cyclin-dependent kinase 2
Ligand
BDBM50103637
Substrate
Meas. Tech.
OctetRed_Method1
Kd
>100000±n/a nM
Citation
 D3R, DD CSAR CDK2-CyclinA D3R 219:0 (2015) Target
Name:
Cyclin-dependent kinase 2
Synonyms:
CDK2 CDK2_HUMAN Cell division protein kinase 2 Protein cereblon/Cyclin-dependent kinase 2 | p33 protein kinase
Type:
Enzyme Subunit
Mol. Mass.:
33938.17
Organism:
Homo sapiens (Human)
Description:
P24941
Residue:
298
  
Inhibitor
Name:
BDBM50103637
Synonyms:
CHEMBL1439622 | CS115
Type:
Small organic molecule
Emp. Form.:
C15H15N5O2
Mol. Mass.:
297.3119
SMILES:
COc1ccc2c(C)nc(Nc3nc(C)cc(O)n3)nc2c1
: