Target
Cyclin-dependent kinase 2
Ligand
BDBM91788
Substrate
Meas. Tech.
OctetRed_Method1
Kd
>100000±n/a nM
Citation
 D3R, DD CSAR CDK2-CyclinA D3R 219:0 (2015) Target
Name:
Cyclin-dependent kinase 2
Synonyms:
CDK2 CDK2_HUMAN Cell division protein kinase 2 Protein cereblon/Cyclin-dependent kinase 2 | p33 protein kinase
Type:
Enzyme Subunit
Mol. Mass.:
33938.17
Organism:
Homo sapiens (Human)
Description:
P24941
Residue:
298
  
Inhibitor
Name:
BDBM91788
Synonyms:
CS34
Type:
Emp. Form.:
C20H21ClN2O5S
Mol. Mass.:
436.909
SMILES:
CC1CCN(CC1)S(=O)(=O)c1ccc(Cl)c(c1)C(=O)Nc1ccc(cc1)C(O)=O
: