Target
Cyclin-dependent kinase 2
Ligand
BDBM7126
Substrate
Meas. Tech.
OctetRed_Method1
Kd
1840±368 nM
Citation
 D3R, DD CSAR CDK2 Kinase D3R 220:0 (2015) Target
Name:
Cyclin-dependent kinase 2
Synonyms:
CDK2 CDK2_HUMAN Cell division protein kinase 2 Protein cereblon/Cyclin-dependent kinase 2 | p33 protein kinase
Type:
Enzyme Subunit
Mol. Mass.:
33938.17
Organism:
Homo sapiens (Human)
Description:
P24941
Residue:
298
  
Inhibitor
Name:
BDBM7126
Synonyms:
3-Propylaminopyrazole deriv. 3 CS2 | N-(5-Cyclopropyl-1H-pyrazol-3-yl)butanamide
Type:
Small organic molecule
Emp. Form.:
C10H15N3O
Mol. Mass.:
193.2456
SMILES:
CCCC(=O)Nc1cc([nH]n1)C1CC1
: