Target
Cyclin-dependent kinase 2
Ligand
BDBM225324
Substrate
Meas. Tech.
OctetRed_Method1
Kd
251±30.5 nM
Citation
 D3R, DD CSAR CDK2 Kinase D3R 220:0 (2015) Target
Name:
Cyclin-dependent kinase 2
Synonyms:
CDK2 CDK2_HUMAN Cell division protein kinase 2 Protein cereblon/Cyclin-dependent kinase 2 | p33 protein kinase
Type:
Enzyme Subunit
Mol. Mass.:
33938.17
Organism:
Homo sapiens (Human)
Description:
P24941
Residue:
298
  
Inhibitor
Name:
BDBM225324
Synonyms:
CS261
Type:
Small Organic Molecule
Emp. Form.:
C20H19N7O4S
Mol. Mass.:
453.474
SMILES:
NS(=O)(=O)c1ccc(N\N=C2/C(=O)Nc3ccc(cc23)C(=O)NCCc2c[nH]cn2)cc1
: