Target
Cyclin-dependent kinase 2
Ligand
BDBM91822
Substrate
Meas. Tech.
OctetRed_Method1
Kd
>100000±n/a nM
Citation
 D3R, DD CSAR CDK2 Kinase D3R 220:0 (2015) Target
Name:
Cyclin-dependent kinase 2
Synonyms:
CDK2 CDK2_HUMAN Cell division protein kinase 2 Protein cereblon/Cyclin-dependent kinase 2 | p33 protein kinase
Type:
Enzyme Subunit
Mol. Mass.:
33938.17
Organism:
Homo sapiens (Human)
Description:
P24941
Residue:
298
  
Inhibitor
Name:
BDBM91822
Synonyms:
CS96
Type:
Emp. Form.:
C18H18ClN5O3S
Mol. Mass.:
419.885
SMILES:
COc1cc(OC)c(NC(=O)CSc2nnc(-c3ccncc3)n2C)cc1Cl
: