Target
Cyclin-dependent kinase 2
Ligand
BDBM91737
Substrate
Meas. Tech.
OctetRed_Method1
Kd
>100000±n/a nM
Citation
 D3R, DD CSAR CDK2 Kinase D3R 220:0 (2015) Target
Name:
Cyclin-dependent kinase 2
Synonyms:
CDK2 CDK2_HUMAN Cell division protein kinase 2 Protein cereblon/Cyclin-dependent kinase 2 | p33 protein kinase
Type:
Enzyme Subunit
Mol. Mass.:
33938.17
Organism:
Homo sapiens (Human)
Description:
P24941
Residue:
298
  
Inhibitor
Name:
BDBM91737
Synonyms:
CS110
Type:
Emp. Form.:
C23H20N4O3S
Mol. Mass.:
432.495
SMILES:
CC(=O)c1cccc(NC(=O)CSc2nnc(-c3cc4ccccc4cc3O)n2C)c1
: