Target
Cyclin-dependent kinase 2
Ligand
BDBM91743
Substrate
Meas. Tech.
OctetRed_Method1
Kd
>100000±n/a nM
Citation
 D3R, DD CSAR CDK2 Kinase D3R 220:0 (2015) Target
Name:
Cyclin-dependent kinase 2
Synonyms:
CDK2 CDK2_HUMAN Cell division protein kinase 2 Protein cereblon/Cyclin-dependent kinase 2 | p33 protein kinase
Type:
Enzyme Subunit
Mol. Mass.:
33938.17
Organism:
Homo sapiens (Human)
Description:
P24941
Residue:
298
  
Inhibitor
Name:
BDBM91743
Synonyms:
CS140
Type:
Emp. Form.:
C16H16N4O3S2
Mol. Mass.:
376.453
SMILES:
CC(Sc1nc2ccccc2[nH]1)C(=O)Nc1ccc(cc1)S(N)(=O)=O
: