Target
Cyclin-dependent kinase 2
Ligand
BDBM91753
Substrate
Meas. Tech.
OctetRed_Method1
Kd
>100000±n/a nM
Citation
 D3R, DD CSAR CDK2 Kinase D3R 220:0 (2015) Target
Name:
Cyclin-dependent kinase 2
Synonyms:
CDK2 CDK2_HUMAN Cell division protein kinase 2 Protein cereblon/Cyclin-dependent kinase 2 | p33 protein kinase
Type:
Enzyme Subunit
Mol. Mass.:
33938.17
Organism:
Homo sapiens (Human)
Description:
P24941
Residue:
298
  
Inhibitor
Name:
BDBM91753
Synonyms:
CS169
Type:
Emp. Form.:
C20H22N4O2S
Mol. Mass.:
382.479
SMILES:
CCc1ccccc1NC(=O)CSc1nnc(-c2cccc(OC)c2)n1C
: