Target
Serine/threonine-protein kinase Chk1 [2-280]
Ligand
BDBM91900
Substrate
Meas. Tech.
33P-Radiometric_Method1
Ki
1910±n/a nM
Citation
 D3R, DD Abbott CHK1 Kinase D3R 221:0 (2015) Target
Name:
Serine/threonine-protein kinase Chk1 [2-280]
Synonyms:
CHEK1 CHK1_HUMAN | CHK1_Kinase
Type:
Mol. Mass.:
32109.16
Organism:
Homo sapiens (Human)
Description:
O14757[2-280]
Residue:
279
  
Inhibitor
Name:
BDBM91900
Synonyms:
Chk1_34
Type:
Emp. Form.:
C15H11ClN4O4
Mol. Mass.:
346.725
SMILES:
COc1ccc(Cl)cc1NC(=O)Nc1cc(C(O)=O)c(cn1)C#N
: